Target
ATP-dependent translocase ABCB1
Ligand
BDBM50084978
Substrate
Meas. Tech.
ChEBML_147985
Kd
4500±n/a nM
Citation
 Maitrejean, MComte, GBarron, DEl Kirat, KConseil, GDi Pietro, A The flavanolignan silybin and its hemisynthetic derivatives, a novel series of potential modulators of P-glycoprotein. Bioorg Med Chem Lett 10:157-60 (2000)  
Target
Name:
ATP-dependent translocase ABCB1
Synonyms:
Abcb1a MDR1A_MOUSE Mdr3 P-glycoprotein 1 and 3 (MDR1a/MDR1b) Pgy-3 | Pgy3
Type:
Protein
Mol. Mass.:
140669.02
Organism:
Mus musculus (Mouse)
Description:
P21447
Residue:
1276
  
Inhibitor
Name:
BDBM50084978
Synonyms:
3,5,7-trihydroxy-2-(4-methoxyphenyl)-4H-chromen-4-one Kaempferide | Kaempferol 4'-methyl ether
Type:
Small organic molecule
Emp. Form.:
C16H12O6
Mol. Mass.:
300.2629
SMILES:
COc1ccc(cc1)-c1oc2cc(O)cc(O)c2c(=O)c1O
: