Target
17-beta-hydroxysteroid dehydrogenase type 3
Ligand
BDBM50451144
Substrate
Meas. Tech.
ChEBML_213263
IC50
67±n/a nM
Citation
 Ngatcha, BTLuu-The, VPoirier, D Androsterone 3beta-substituted derivatives as inhibitors of type 3 17beta-hydroxysteroid dehydrogenase. Bioorg Med Chem Lett 10:2533-6 (2001)  
Target
Name:
17-beta-hydroxysteroid dehydrogenase type 3
Synonyms:
17-beta-hydroxysteroid dehydrogenase type 3 EDH17B3 HSD17B3 | SDR12C2
Type:
Enzyme
Mol. Mass.:
34525.39
Organism:
Homo sapiens (Human)
Description:
P37058
Residue:
310
  
Inhibitor
Name:
BDBM50451144
Synonyms:
CHEMBL3137851
Type:
Small organic molecule
Emp. Form.:
C22H36O2
Mol. Mass.:
332.52
SMILES:
[H][C@@]12CCC(=O)[C@@]1(C)CC[C@@]1([H])[C@@]2([H])CCC2C[C@@](O)(CCC)CC[C@]12C
: