Target
Nitric oxide synthase, inducible
Ligand
BDBM50095177
Substrate
Meas. Tech.
ChEBML_89175
Ki
700±n/a nM
Citation
 Lee, YMartásek, PRoman, LJSilverman, RB 1H-pyrazole-1-carboxamidines: new inhibitors of nitric oxide synthase. Bioorg Med Chem Lett 10:2771-4 (2000)  
Target
Name:
Nitric oxide synthase, inducible
Synonyms:
Inducible NO synthase Inducible nitric oxide synthase (iNOS) MAC-NOS NOS type II Nitric Oxide Synthase, inducible Nos2
Type:
Enzyme
Mol. Mass.:
130595.79
Organism:
Mus musculus (mouse)
Description:
Recombinant enzyme overexpressed in E. coli.
Residue:
1144
  
Inhibitor
Name:
BDBM50095177
Synonyms:
CHEMBL503356 Pyrazole-1-carboxamidine; hydrochloride
Type:
Small organic molecule
Emp. Form.:
C4H6N4
Mol. Mass.:
110.1172
SMILES:
NC(=N)n1cccn1
: