Target
Prothrombin
Ligand
BDBM50085449
Substrate
Meas. Tech.
ChEMBL_160978 (CHEMBL769319)
Ki
125±n/a nM
Citation
 Hanessian, SBalaux, EMusil, DOlsson, LLNilsson, I Exploring the chiral space within the active site of alpha-thrombin with a constrained mimic of D-Phe-Pro-Arg--design, synthesis, inhibitory activity, and X-ray structure of an enzyme-inhibitor complex. Bioorg Med Chem Lett 10:243-7 (2000)  
Target
Name:
Prothrombin
Synonyms:
Activation peptide fragment 1 Coagulation factor II Prothrombin precursor Thrombin heavy chain | Thrombin light chain
Type:
Protein
Mol. Mass.:
70029.57
Organism:
Homo sapiens (Human)
Description:
P00734
Residue:
622
  
Inhibitor
Name:
BDBM50085449
Synonyms:
(3S,6S,8S,8aS)-6-Benzyl-6-hydroxy-8-methoxy-5-oxo-octahydro-indolizine-3-carboxylic acid 4-carbamimidoyl-benzylamide; hydrochloride | CHEMBL558594
Type:
Small organic molecule
Emp. Form.:
C25H30N4O4
Mol. Mass.:
450.5301
SMILES:
CO[C@H]1C[C@@](O)(Cc2ccccc2)C(=O)N2[C@H]1CC[C@H]2C(=O)NCc1ccc(cc1)C(N)=N
: