Target
Adenosine receptor A1
Ligand
BDBM21220
Substrate
Meas. Tech.
ChEBML_29424
Ki
1±n/a nM
Citation
 Keeling, SEAlbinson, FDAyres, BEButchers, PRChambers, CLCherry, PCEllis, FEwan, GBGregson, MKnight, JMills, KRavenscroft, PReynolds, LHSanjar, SSheehan, MJ The discovery and synthesis of highly potent, A2a receptor agonists. Bioorg Med Chem Lett 10:403-6 (2000)  
Target
Name:
Adenosine receptor A1
Synonyms:
A1 adenosine receptor ADENOSINE A1 ADENOSINE A1 low Adenosine A1 receptor | Adenosine Receptor A1
Type:
Enzyme Catalytic Domain
Mol. Mass.:
36501.39
Organism:
GUINEA PIG
Description:
ADENOSINE A1 ADORA1 GUINEA PIG::P47745
Residue:
326
  
Inhibitor
Name:
BDBM21220
Synonyms:
(2S,3S,4R,5R)-5-(6-amino-9H-purin-9-yl)-N-ethyl-3,4-dihydroxyoxolane-2-carboxamide Adenosine, N6-Ethyl-carboxamido CHEMBL464859 NECA
Type:
Antineoplastic Agent
Emp. Form.:
C12H16N6O4
Mol. Mass.:
308.2932
SMILES:
CCNC(=O)[C@H]1O[C@H]([C@H](O)[C@@H]1O)n1cnc2c(N)ncnc12
: