Target
Adenosine receptor A1
Ligand
BDBM50085666
Substrate
Meas. Tech.
ChEBML_29424
Ki
672±n/a nM
Citation
 Keeling, SEAlbinson, FDAyres, BEButchers, PRChambers, CLCherry, PCEllis, FEwan, GBGregson, MKnight, JMills, KRavenscroft, PReynolds, LHSanjar, SSheehan, MJ The discovery and synthesis of highly potent, A2a receptor agonists. Bioorg Med Chem Lett 10:403-6 (2000)  
Target
Name:
Adenosine receptor A1
Synonyms:
A1 adenosine receptor ADENOSINE A1 ADENOSINE A1 low Adenosine A1 receptor | Adenosine Receptor A1
Type:
Enzyme Catalytic Domain
Mol. Mass.:
36501.39
Organism:
GUINEA PIG
Description:
ADENOSINE A1 ADORA1 GUINEA PIG::P47745
Residue:
326
  
Inhibitor
Name:
BDBM50085666
Synonyms:
(2S,3S,4R,5R)-5-{6-(2,2-Diphenyl-ethylamino)-2-[2-(1H-imidazol-4-yl)-ethylamino]-purin-9-yl}-3,4-dihydroxy-tetrahydro-furan-2-carboxylic acid ethylamide | CHEMBL336608
Type:
Small organic molecule
Emp. Form.:
C31H35N9O4
Mol. Mass.:
597.6675
SMILES:
CCNC(=O)[C@H]1O[C@H]([C@H](O)[C@@H]1O)n1cnc2c(NCC(c3ccccc3)c3ccccc3)nc(NCCc3cnc[nH]3)nc12
: