Target
Kappa-type opioid receptor
Ligand
BDBM50087685
Substrate
Meas. Tech.
ChEBML_145705
Ki
2.9±n/a nM
Citation
 Röver, SWichmann, JJenck, FAdam, GCesura, AM ORL1 receptor ligands: structure-activity relationships of 8-cycloalkyl-1-phenyl-1,3,8-triaza-spiro[4.5]decan-4-ones. Bioorg Med Chem Lett 10:831-4 (2000)  
Target
Name:
Kappa-type opioid receptor
Synonyms:
KOR-1 OPIATE Kappa Opioid receptor Ror-d
Type:
G Protein-Coupled Receptor (GPCR)
Mol. Mass.:
42692.90
Organism:
Rattus norvegicus (rat)
Description:
P34975
Residue:
380
  
Inhibitor
Name:
BDBM50087685
Synonyms:
8-Cyclododecyl-1-phenyl-1,3,8-triaza-spiro[4.5]decan-4-one | CHEMBL354652
Type:
Small organic molecule
Emp. Form.:
C25H39N3O
Mol. Mass.:
397.5967
SMILES:
O=C1NCN(c2ccccc2)C11CCN(CC1)C1CCCCCCCCCCC1
: