Target
Fructose-1,6-bisphosphatase 1
Ligand
BDBM4626
Substrate
Meas. Tech.
ChEBML_192347
IC50
>10000±n/a nM
Citation
 Wright, SWHageman, DLMcClure, LDCarlo, AATreadway, JLMathiowetz, AMWithka, JMBauer, PH Allosteric inhibition of fructose-1,6-bisphosphatase by anilinoquinazolines. Bioorg Med Chem Lett 11:17-21 (2001)  
Target
Name:
Fructose-1,6-bisphosphatase 1
Synonyms:
F16P1_RAT Fbp1 | Fructose-1,6-bisphosphatase
Type:
PROTEIN
Mol. Mass.:
39605.40
Organism:
Rattus norvegicus
Description:
ChEMBL_595158
Residue:
363
  
Inhibitor
Name:
BDBM4626
Synonyms:
Anilinoquinazoline deriv. 9 N-(3-chloro-4-fluorophenyl)-6,7-dimethoxyquinazolin-4-amine
Type:
Small organic molecule
Emp. Form.:
C16H13ClFN3O2
Mol. Mass.:
333.745
SMILES:
COc1cc2ncnc(Nc3ccc(F)c(Cl)c3)c2cc1OC
: