Target
1,3-beta-glucan synthase
Ligand
BDBM50100336
Substrate
Meas. Tech.
ChEBML_39039
IC50
1.4±n/a nM
Citation
 Masubuchi, KOkada, TKohchi, MMurata, TTsukazaki, MKondoh, OYamazaki, TSatoh, YOno, YTsukaguchi, TKobayashi, KOno, NInoue, THorii, IShimma, N Synthesis and antifungal activities of novel 1,3-beta-D-glucan synthase inhibitors. Part 2. Bioorg Med Chem Lett 11:1273-6 (2001)  
Target
Name:
1,3-beta-glucan synthase
Synonyms:
1,3-beta-glucan synthase Glucan Synthase
Type:
Enzyme
Mol. Mass.:
218006.59
Organism:
Candida albicans (Yeast)
Description:
O13428
Residue:
1897
  
Inhibitor
Name:
BDBM50100336
Synonyms:
CHEMBL405487 | RO-09-3655 derivative
Type:
Small organic molecule
Emp. Form.:
C75H126N16O23
Mol. Mass.:
1619.8963
SMILES:
CCCCCCCCCCCCC[C@@H]1CC(=O)N[C@H]([C@@H](C)O)C(=O)N[C@H](C)C(=O)N[C@@H](Cc2ccc(O)cc2)C(=O)N[C@@H](C(C)C)C(=O)N2C[C@H](O)C[C@H]2C(=O)N[C@H]([C@@H](C)O)C(=O)N[C@@H]([C@@H](C)O)C(=O)N2CC[C@H](O)[C@H]2C(=O)N[C@@H]([C@H](O)CC(N)=O)C(=O)NCC(=O)N[C@H]([C@@H](C)O)C(=O)N[C@@H](CCCN(CCN)CCN)C(=O)O1
: