Target
Sodium- and chloride-dependent glycine transporter 2
Ligand
BDBM50099863
Substrate
Meas. Tech.
ChEBML_72767
IC50
1170±n/a nM
Citation
 Isaac, MSlassi, ASilva, KDArora, JMacLean, NHung, BMcCallum, K 5,5-Diaryl-2-amino-4-pentenoates as novel, potent, and selective glycine transporter type-2 reuptake inhibitors. Bioorg Med Chem Lett 11:1371-3 (2001)  
Target
Name:
Sodium- and chloride-dependent glycine transporter 2
Synonyms:
Glycine transporter 2 SC6A5_RAT | Slc6a5
Type:
PROTEIN
Mol. Mass.:
87845.43
Organism:
Rattus norvegicus
Description:
ChEMBL_980598
Residue:
799
  
Inhibitor
Name:
BDBM50099863
Synonyms:
CHEMBL29023 | Sodium; (E)-2-amino-5-(2,4-difluoro-phenyl)-5-p-tolyl-pent-4-enoate
Type:
Small organic molecule
Emp. Form.:
C18H16F2NO2
Mol. Mass.:
316.3225
SMILES:
Cc1ccc(cc1)C(=C/CC(N)C([O-])=O)\c1ccc(F)cc1F
: