Target
Neutrophil collagenase
Ligand
BDBM50100090
Substrate
Meas. Tech.
ChEBML_105212
IC50
80±n/a nM
Citation
 Baxter, ADBhogal, RBird, JKeily, JFManallack, DTMontana, JGOwen, DAPitt, WRWatson, RJWills, RE Arylsulphonyl hydroxamic acids: potent and selective matrix metalloproteinase inhibitors. Bioorg Med Chem Lett 11:1465-8 (2001)  
Target
Name:
Neutrophil collagenase
Synonyms:
CLG1 MMP8 Matrix metalloproteinase-8 PMNL collagenase | PMNL-CL
Type:
Enzyme
Mol. Mass.:
53413.48
Organism:
Homo sapiens (Human)
Description:
P22894
Residue:
467
  
Inhibitor
Name:
BDBM50100090
Synonyms:
2-[4-(1-Oxy-pyridine-4-carbonyl)-benzenesulfonylmethyl]-5-phenyl-pentanoic acid hydroxyamide | CHEMBL288099
Type:
Small organic molecule
Emp. Form.:
C24H24N2O6S
Mol. Mass.:
468.522
SMILES:
ONC(=O)C(CCCc1ccccc1)CS(=O)(=O)c1ccc(cc1)C(=O)c1cc[n+]([O-])cc1
: