Target
Phenylethanolamine N-methyltransferase
Ligand
BDBM13016
Substrate
Meas. Tech.
ChEBML_152574
Ki
15000±n/a nM
Citation
 Grunewald, GLMcLeish, MJCriscione, KR Phenylethanolamine N-methyltransferase kinetics: bovine versus recombinant human enzyme. Bioorg Med Chem Lett 11:1579-82 (2001)  
Target
Name:
Phenylethanolamine N-methyltransferase
Synonyms:
Noradrenaline N-methyltransferase PNMT PNMTase | Phenylethanolamine N-Methyltransferase (PNMT)
Type:
Enzyme
Mol. Mass.:
30852.66
Organism:
Homo sapiens (Human)
Description:
Residue:
282
  
Inhibitor
Name:
BDBM13016
Synonyms:
1,2,3,4-tetrahydroisoquinoline THIQ 6 | tetrahydroisoquinoline
Type:
Small organic molecule
Emp. Form.:
C9H11N
Mol. Mass.:
133.1903
SMILES:
C1Cc2ccccc2CN1
: