Target
Carbonic anhydrase 4
Ligand
BDBM50101353
Substrate
Meas. Tech.
ChEBML_45271
Ki
75±n/a nM
Citation
 Mincione, FStarnotti, MMenabuoni, LScozzafava, ACasini, ASupuran, CT Carbonic anhydrase inhibitors: 4-sulfamoyl-benzenecarboxamides and 4-chloro-3-sulfamoyl-benzenecarboxamides with strong topical antiglaucoma properties. Bioorg Med Chem Lett 11:1787-91 (2001)  
Target
Name:
Carbonic anhydrase 4
Synonyms:
CA-IV CAH4_BOVIN Carbonic Anhydrase IV Carbonic anhydrase 4
Type:
Enzyme
Mol. Mass.:
35152.74
Organism:
Bos taurus (bovine)
Description:
Bovine isozyme, isolated from lung microsomes
Residue:
312
  
Inhibitor
Name:
BDBM50101353
Synonyms:
(S)-2-(4-Sulfamoyl-benzoylamino)-propionic acid | CHEMBL50446
Type:
Small organic molecule
Emp. Form.:
C10H12N2O5S
Mol. Mass.:
272.278
SMILES:
C[C@H](NC(=O)c1ccc(cc1)S(N)(=O)=O)C(O)=O
: