Target
Carbonic anhydrase 4
Ligand
BDBM50101354
Substrate
Meas. Tech.
ChEBML_45271
Ki
395±n/a nM
Citation
 Mincione, FStarnotti, MMenabuoni, LScozzafava, ACasini, ASupuran, CT Carbonic anhydrase inhibitors: 4-sulfamoyl-benzenecarboxamides and 4-chloro-3-sulfamoyl-benzenecarboxamides with strong topical antiglaucoma properties. Bioorg Med Chem Lett 11:1787-91 (2001)  
Target
Name:
Carbonic anhydrase 4
Synonyms:
CA-IV CAH4_BOVIN Carbonic Anhydrase IV Carbonic anhydrase 4
Type:
Enzyme
Mol. Mass.:
35152.74
Organism:
Bos taurus (bovine)
Description:
Bovine isozyme, isolated from lung microsomes
Residue:
312
  
Inhibitor
Name:
BDBM50101354
Synonyms:
(S)-2-(4-Chloro-3-sulfamoyl-benzoylamino)-3-hydroxy-propionic acid | CHEMBL51416
Type:
Small organic molecule
Emp. Form.:
C10H11ClN2O6S
Mol. Mass.:
322.722
SMILES:
NS(=O)(=O)c1cc(ccc1Cl)C(=O)N[C@@H](CO)C(O)=O
: