Target
Estrogen receptor
Ligand
BDBM50101979
Substrate
Meas. Tech.
ChEMBL_67502 (CHEMBL679893)
IC50
1100±n/a nM
Citation
 Matsuda, HShimoda, HMorikawa, TYoshikawa, M Phytoestrogens from the roots of Polygonum cuspidatum (Polygonaceae): structure-requirement of hydroxyanthraquinones for estrogenic activity. Bioorg Med Chem Lett 11:1839-42 (2001)  
Target
Name:
Estrogen receptor
Synonyms:
ER ESR ESR1_HUMAN Estrogen receptor Estrogen receptor (ER-alpha) Estrogen receptor alpha (ER) Nuclear receptor subfamily 3 group A member 1
Type:
Protein
Mol. Mass.:
66230.44
Organism:
Homo sapiens (Human)
Description:
P03372
Residue:
595
  
Inhibitor
Name:
BDBM50101979
Synonyms:
2,6-Dihydroxyanthraquinone 2,6-dihydroxy-9,10-anthraquinone 2,6-dihydroxyanthracene-9,10-dione CHEMBL298398 anthraflavin
Type:
Small organic molecule
Emp. Form.:
C14H8O4
Mol. Mass.:
240.2109
SMILES:
Oc1ccc2C(=O)c3cc(O)ccc3C(=O)c2c1
: