Target
Estrogen receptor beta
Ligand
BDBM11318
Substrate
Meas. Tech.
ChEBML_67827
Ki
1500±n/a nM
Citation
 Matsuda, HShimoda, HMorikawa, TYoshikawa, M Phytoestrogens from the roots of Polygonum cuspidatum (Polygonaceae): structure-requirement of hydroxyanthraquinones for estrogenic activity. Bioorg Med Chem Lett 11:1839-42 (2001)  
Target
Name:
Estrogen receptor beta
Synonyms:
ER-beta ESR2_HUMAN Estradiol receptor beta (ERβ) Estrogen receptor (ER beta) Estrogen receptor beta (ER beta) NR3A2 estrogen beta
Type:
Protein
Mol. Mass.:
59238.43
Organism:
Homo sapiens (Human)
Description:
Q92731
Residue:
530
  
Inhibitor
Name:
BDBM11318
Synonyms:
1,3,8-trihydroxy-6-methyl-9,10-dihydroanthracene-9,10-dione CHEMBL289277 US20230364057, Compound 242 | med.21724, Compound 24
Type:
Small organic molecule
Emp. Form.:
C15H10O5
Mol. Mass.:
270.2369
SMILES:
Cc1cc(O)c2C(=O)c3c(O)cc(O)cc3C(=O)c2c1
: