Target
Beta-glucosidase A
Ligand
BDBM50104304
Substrate
Meas. Tech.
ChEMBL_37437 (CHEMBL650052)
IC50
340000±n/a nM
Citation
 Popowycz, FGerber-Lemaire, SDemange, RRodriguez-García, EAsenjo, ATRobina, IVogel, P Derivatives of (2R,3R,4S)-2-aminomethylpyrrolidine-3,4-diol are selective alpha-mannosidase inhibitors. Bioorg Med Chem Lett 11:2489-93 (2001)  
Target
Name:
Beta-glucosidase A
Synonyms:
BGLS_CALSA | bglA
Type:
PROTEIN
Mol. Mass.:
53484.21
Organism:
Caldocellum saccharolyticum
Description:
ChEMBL_37437
Residue:
455
  
Inhibitor
Name:
BDBM50104304
Synonyms:
2-[((S)-1-Hydroxy-ethylamino)-methyl]-pyrrolidine-3,4-diol CHEMBL2206826
Type:
Small organic molecule
Emp. Form.:
C7H16N2O3
Mol. Mass.:
176.2135
SMILES:
C[C@@H](O)NC[C@H]1NC[C@H](O)[C@@H]1O
: