Target
P2Y purinoceptor 6
Ligand
BDBM50403871
Substrate
Meas. Tech.
ChEBML_86463
EC50
100±n/a nM
Citation
 Pendergast, WYerxa, BRDouglass, JGShaver, SRDougherty, RWRedick, CCSims, IFRideout, JL Synthesis and P2Y receptor activity of a series of uridine dinucleoside 5'-polyphosphates. Bioorg Med Chem Lett 11:157-60 (2001)  
Target
Name:
P2Y purinoceptor 6
Synonyms:
P2RY6 P2Y purinoceptor 6 Pyrimidinergic receptor P2Y6
Type:
PROTEIN
Mol. Mass.:
36452.29
Organism:
Homo sapiens (Human)
Description:
ChEMBL_1511151
Residue:
328
  
Inhibitor
Name:
BDBM50403871
Synonyms:
URIDINE_DIPHOSPHATE
Type:
Small organic molecule
Emp. Form.:
C9H14N2O12P2
Mol. Mass.:
404.1612
SMILES:
O[C@@H]1[C@@H](CO[P@](O)(=O)OP(O)(O)=O)O[C@H]([C@@H]1O)n1ccc(=O)[nH]c1=O
: