Target
Genome polyprotein
Ligand
BDBM50084634
Substrate
Meas. Tech.
ChEMBL_143617 (CHEMBL751677)
Ki
360±n/a nM
Citation
 Johansson, AHubatsch, IAkerblom, ELindeberg, GWiniwarter, SDanielson, UHHallberg, A Inhibition of hepatitis C virus NS3 protease activity by product-based peptides is dependent on helicase domain. Bioorg Med Chem Lett 11:203-6 (2001)  
Target
Name:
Genome polyprotein
Synonyms:
Hepatitis C virus NS3 protease/helicase | Hepatitis C virus serine protease, NS3/NS4A
Type:
Protein
Mol. Mass.:
67067.41
Organism:
Hepatitis C virus
Description:
A3EZI9
Residue:
631
  
Inhibitor
Name:
BDBM50084634
Synonyms:
4-(2-Acetylamino-3-carboxy-propionylamino)-4-(1-{3-carboxy-1-[3-carboxy-1-(1-carboxy-2-mercapto-ethylcarbamoyl)-propylcarbamoyl]-propylcarbamoyl}-3-methylsulfanyl-propylcarbamoyl)-butyric acid(NS4A-NS4B) CHEMBL62717
Type:
Small organic molecule
Emp. Form.:
C29H44N6O16S2
Mol. Mass.:
796.82
SMILES:
CSCC[C@H](NC(=O)[C@H](CCC(O)=O)NC(=O)[C@H](CC(O)=O)NC(C)=O)C(=O)N[C@@H](CCC(O)=O)C(=O)N[C@@H](CCC(O)=O)C(=O)N[C@@H](CS)C(O)=O
: