Target
72 kDa type IV collagenase
Ligand
BDBM50105450
Substrate
Meas. Tech.
ChEBML_104378
IC50
<0.100000±n/a nM
Citation
 Becker, DPDeCrescenzo, GFreskos, JGetman, DPHockerman, SLLi, MMehta, PMunie, GESwearingen, C alpha-Alkyl-alpha-amino-beta-sulphone hydroxamates as potent MMP inhibitors that spare MMP-1. Bioorg Med Chem Lett 11:2723-5 (2001)  
Target
Name:
72 kDa type IV collagenase
Synonyms:
72 kDa gelatinase CLG4A Gelatinase A (MMP-2) MMP2_HUMAN Matrix metalloproteinase-2 (MMP 2) Matrix metalloproteinases 2 (MMP-2) | TBE-1
Type:
Enzyme
Mol. Mass.:
73870.36
Organism:
Homo sapiens (Human)
Description:
P08253
Residue:
660
  
Inhibitor
Name:
BDBM50105450
Synonyms:
2-(4-Phenoxy-benzenesulfonylmethyl)-1-prop-2-ynyl-pyrrolidine-2-carboxylic acid hydroxyamide | CHEMBL92899
Type:
Small organic molecule
Emp. Form.:
C21H22N2O5S
Mol. Mass.:
414.475
SMILES:
ONC(=O)C1(CS(=O)(=O)c2ccc(Oc3ccccc3)cc2)CCCN1CC#C
: