Target
72 kDa type IV collagenase
Ligand
BDBM50063917
Substrate
Meas. Tech.
ChEBML_104378
IC50
0.750000±n/a nM
Citation
 Becker, DPDeCrescenzo, GFreskos, JGetman, DPHockerman, SLLi, MMehta, PMunie, GESwearingen, C alpha-Alkyl-alpha-amino-beta-sulphone hydroxamates as potent MMP inhibitors that spare MMP-1. Bioorg Med Chem Lett 11:2723-5 (2001)  
Target
Name:
72 kDa type IV collagenase
Synonyms:
72 kDa gelatinase CLG4A Gelatinase A (MMP-2) MMP2_HUMAN Matrix metalloproteinase-2 (MMP 2) Matrix metalloproteinases 2 (MMP-2) | TBE-1
Type:
Enzyme
Mol. Mass.:
73870.36
Organism:
Homo sapiens (Human)
Description:
P08253
Residue:
660
  
Inhibitor
Name:
BDBM50063917
Synonyms:
(2S,3R)-N(4)-[(2S)-3,3-dimethyl-1-(methylamino)-1-oxobutan-2-yl]-N(1),2-dihydroxy-3-(2-methylpropyl)butanediamide cid_119031 | marimastat
Type:
Small organic molecule
Emp. Form.:
C15H29N3O5
Mol. Mass.:
331.4079
SMILES:
CNC(=O)[C@@H](NC(=O)[C@H](CC(C)C)[C@H](O)C(=O)NO)C(C)(C)C
: