Target
72 kDa type IV collagenase
Ligand
BDBM50105455
Substrate
Meas. Tech.
ChEBML_104378
IC50
1.3±n/a nM
Citation
 Becker, DPDeCrescenzo, GFreskos, JGetman, DPHockerman, SLLi, MMehta, PMunie, GESwearingen, C alpha-Alkyl-alpha-amino-beta-sulphone hydroxamates as potent MMP inhibitors that spare MMP-1. Bioorg Med Chem Lett 11:2723-5 (2001)  
Target
Name:
72 kDa type IV collagenase
Synonyms:
72 kDa gelatinase CLG4A Gelatinase A (MMP-2) MMP2_HUMAN Matrix metalloproteinase-2 (MMP 2) Matrix metalloproteinases 2 (MMP-2) | TBE-1
Type:
Enzyme
Mol. Mass.:
73870.36
Organism:
Homo sapiens (Human)
Description:
P08253
Residue:
660
  
Inhibitor
Name:
BDBM50105455
Synonyms:
2-Ethylamino-N-hydroxy-2-methyl-3-(4-phenoxy-benzenesulfonyl)-propionamide | CHEMBL90211
Type:
Small organic molecule
Emp. Form.:
C18H22N2O5S
Mol. Mass.:
378.443
SMILES:
CCNC(C)(CS(=O)(=O)c1ccc(Oc2ccccc2)cc1)C(=O)NO
: