Target
Collagenase 3
Ligand
BDBM50105455
Substrate
Meas. Tech.
ChEBML_106599
IC50
1.6±n/a nM
Citation
 Becker, DPDeCrescenzo, GFreskos, JGetman, DPHockerman, SLLi, MMehta, PMunie, GESwearingen, C alpha-Alkyl-alpha-amino-beta-sulphone hydroxamates as potent MMP inhibitors that spare MMP-1. Bioorg Med Chem Lett 11:2723-5 (2001)  
Target
Name:
Collagenase 3
Synonyms:
MMP-13 MMP13_HUMAN Matrix metalloproteinase-13 (MMP-13) | Matrix metalloproteinase-13 (MMP13)
Type:
Enzyme
Mol. Mass.:
53808.06
Organism:
Homo sapiens (Human)
Description:
P45452
Residue:
471
  
Inhibitor
Name:
BDBM50105455
Synonyms:
2-Ethylamino-N-hydroxy-2-methyl-3-(4-phenoxy-benzenesulfonyl)-propionamide | CHEMBL90211
Type:
Small organic molecule
Emp. Form.:
C18H22N2O5S
Mol. Mass.:
378.443
SMILES:
CCNC(C)(CS(=O)(=O)c1ccc(Oc2ccccc2)cc1)C(=O)NO
: