Target
Delta-type opioid receptor
Ligand
BDBM50017233
Substrate
Meas. Tech.
ChEBML_147151
Ki
4.2±n/a nM
Citation
 Neumeyer, JLGu, XHvan Vliet, LADeNunzio, NJRusovici, DECohen, DJNegus, SSMello, NKBidlack, JM Mixed kappa agonists and mu agonists/antagonists as potential pharmacotherapeutics for cocaine abuse: synthesis and opioid receptor binding affinity of N-substituted derivatives of morphinan. Bioorg Med Chem Lett 11:2735-40 (2001)  
Target
Name:
Delta-type opioid receptor
Synonyms:
D-OR-1 Delta opioid receptor OPIATE Delta OPRD1 OPRK1 | opioid receptor, delta 1
Type:
G Protein-Coupled Receptor (GPCR)
Mol. Mass.:
40382.98
Organism:
Homo sapiens (Human)
Description:
Competition binding assays were carried out using membrane preparations from transfected HN9.10 cells that constitutively expressed the delta opioid receptor.
Residue:
372
  
Inhibitor
Name:
BDBM50017233
Synonyms:
CHEMBL592 LEVORPHANOL
Type:
Small organic molecule
Emp. Form.:
C17H23NO
Mol. Mass.:
257.3706
SMILES:
CN1CC[C@]23CCCC[C@H]2[C@H]1Cc1ccc(O)cc31
: