Target
Protein phosphatase 1B
Ligand
BDBM50106043
Substrate
Meas. Tech.
ChEBML_161764
IC50
>1000000±n/a nM
Citation
 McCluskey, AWalkom, CBowyer, MCAckland, SPGardiner, ESakoff, JA Cantharimides: a new class of modified cantharidin analogues inhibiting protein phosphatases 1 and 2A. Bioorg Med Chem Lett 11:2941-6 (2001)  
Target
Name:
Protein phosphatase 1B
Synonyms:
PP2C-beta PPM1B Protein phosphatase 1B Protein phosphatase 2C isoform beta
Type:
PROTEIN
Mol. Mass.:
52620.37
Organism:
Homo sapiens (Human)
Description:
ChEMBL_161756
Residue:
479
  
Inhibitor
Name:
BDBM50106043
Synonyms:
(R)-2-((1S,2R,6S,7R)-3,5-Dioxo-10-oxa-4-aza-tricyclo[5.2.1.0*2,6*]dec-4-yl)-3-methylsulfanyl-propionic acid | CHEMBL432193
Type:
Small organic molecule
Emp. Form.:
C12H15NO5S
Mol. Mass.:
285.316
SMILES:
CSC[C@H](N1C(=O)[C@H]2[C@@H]3CC[C@@H](O3)[C@H]2C1=O)C(O)=O
: