Target
Beta-3 adrenergic receptor
Ligand
BDBM50106808
Substrate
Meas. Tech.
ChEBML_39052
Ki
570±n/a nM
Citation
Target
Name:
Beta-3 adrenergic receptor
Synonyms:
ADRB3 ADRB3_HUMAN Beta-2 adrenergic receptor and beta-3 adrenergic receptor Beta-3 adrenoreceptor | adrenergic Beta3
Type:
G Protein-Coupled Receptor (GPCR)
Mol. Mass.:
43534.88
Organism:
Homo sapiens (Human)
Description:
Residue:
408
  
Inhibitor
Name:
BDBM50106808
Synonyms:
6-[2-Hydroxy-2-(4-hydroxy-3-methanesulfonylamino-phenyl)-ethylamino]-7-phenyl-heptanoic acid methyl ester | CHEMBL102364
Type:
Small organic molecule
Emp. Form.:
C23H32N2O6S
Mol. Mass.:
464.575
SMILES:
COC(=O)CCCCC(Cc1ccccc1)NCC(O)c1ccc(O)c(NS(C)(=O)=O)c1
: