Target
Beta-3 adrenergic receptor
Ligand
BDBM50106813
Substrate
Meas. Tech.
ChEBML_39052
Ki
550±n/a nM
Citation
Target
Name:
Beta-3 adrenergic receptor
Synonyms:
ADRB3 ADRB3_HUMAN Beta-2 adrenergic receptor and beta-3 adrenergic receptor Beta-3 adrenoreceptor | adrenergic Beta3
Type:
G Protein-Coupled Receptor (GPCR)
Mol. Mass.:
43534.88
Organism:
Homo sapiens (Human)
Description:
Residue:
408
  
Inhibitor
Name:
BDBM50106813
Synonyms:
CHEMBL316546 | N-(5-{2-[2-(3,4-Dimethoxy-phenyl)-ethylamino]-1-hydroxy-ethyl}-2-hydroxy-phenyl)-methanesulfonamide
Type:
Small organic molecule
Emp. Form.:
C19H26N2O6S
Mol. Mass.:
410.485
SMILES:
COc1ccc(CCNCC(O)c2ccc(O)c(NS(C)(=O)=O)c2)cc1OC
: