Target
Neuraminidase
Ligand
BDBM50097659
Substrate
Meas. Tech.
ChEBML_200653
IC50
100±n/a nM
Citation
 Wyatt, PGCoomber, BAEvans, DNJack, TIFulton, HEWonacott, AJColman, PVarghese, J Sialidase inhibitors related to zanamivir. Further SAR studies of 4-amino-4H-pyran-2-carboxylic acid-6-propylamides. Bioorg Med Chem Lett 11:669-73 (2001)  
Target
Name:
Neuraminidase
Synonyms:
Influenza B Virus Neuraminidase NRAM_INBLE Neuraminidase B
Type:
Enzyme
Mol. Mass.:
51446.67
Organism:
Influenza B virus (B/Lee/40)
Description:
Residue:
466
  
Inhibitor
Name:
BDBM50097659
Synonyms:
(4S,5R,6R)-4-Amino-6-(phenethyl-propyl-carbamoyl)-5-(2,2,2-trifluoro-acetylamino)-5,6-dihydro-4H-pyran-2-carboxylic acid | CHEMBL348066
Type:
Small organic molecule
Emp. Form.:
C20H24F3N3O5
Mol. Mass.:
443.4169
SMILES:
CCCN(CCc1ccccc1)C(=O)[C@@H]1OC(=C[C@H](N)[C@H]1NC(=O)C(F)(F)F)C(O)=O
: