Target
Neuraminidase
Ligand
BDBM50097659
Substrate
Meas. Tech.
ChEBML_200639
IC50
3±n/a nM
Citation
 Wyatt, PGCoomber, BAEvans, DNJack, TIFulton, HEWonacott, AJColman, PVarghese, J Sialidase inhibitors related to zanamivir. Further SAR studies of 4-amino-4H-pyran-2-carboxylic acid-6-propylamides. Bioorg Med Chem Lett 11:669-73 (2001)  
Target
Name:
Neuraminidase
Synonyms:
Influenza A Virus Neuraminidase NRAM_I34A1 Neuraminidase A
Type:
Enzyme
Mol. Mass.:
50124.14
Organism:
Influenza A virus (A/Puerto Rico/8/34/Mount Sinai(H1N1))
Description:
P03468
Residue:
454
  
Inhibitor
Name:
BDBM50097659
Synonyms:
(4S,5R,6R)-4-Amino-6-(phenethyl-propyl-carbamoyl)-5-(2,2,2-trifluoro-acetylamino)-5,6-dihydro-4H-pyran-2-carboxylic acid | CHEMBL348066
Type:
Small organic molecule
Emp. Form.:
C20H24F3N3O5
Mol. Mass.:
443.4169
SMILES:
CCCN(CCc1ccccc1)C(=O)[C@@H]1OC(=C[C@H](N)[C@H]1NC(=O)C(F)(F)F)C(O)=O
: