Target
B2 bradykinin receptor
Ligand
BDBM50097732
Substrate
Meas. Tech.
ChEBML_40436
IC50
>100000±n/a nM
Citation
 Dziadulewicz, EKWalpole, CSSnell, CRWrigglesworth, RHughes, GABeattie, DWood, JNBeech, MMCoote, PR Design of non-peptide CCK2 and NK1 peptidomimetics using 1-(2-nitrophenyl)thiosemicarbazide as a novel common scaffold. Bioorg Med Chem Lett 11:705-9 (2001)  
Target
Name:
B2 bradykinin receptor
Synonyms:
B2 BRADYKININ B2R BKRB2_RAT Bradykinin B2 receptor
Type:
Enzyme Catalytic Domain
Mol. Mass.:
44941.22
Organism:
RAT
Description:
B2 BRADYKININ BDKRB2 RAT::P25023
Residue:
396
  
Inhibitor
Name:
BDBM50097732
Synonyms:
1-(2-nitrophenyl)thiosemicarbazide analogue | CHEMBL349046
Type:
Small organic molecule
Emp. Form.:
C27H28N6O6S2
Mol. Mass.:
596.678
SMILES:
OC(=O)CCN(Cc1ccccc1)S(=O)(=O)c1ccc(N[N-]C(=[SH+])NCCc2c[nH]c3ccccc23)c(c1)[N+]([O-])=O
: