Target
Collagenase 3
Ligand
BDBM50098914
Substrate
Meas. Tech.
ChEBML_106619
IC50
2.1±n/a nM
Citation
 Pikul, SDunham, KMAlmstead, NGDe, BNatchus, MGTaiwo, YOWilliams, LEHynd, BAHsieh, LCJanusz, MJGu, FMieling, GE Heterocycle-based MMP inhibitors with P2' substituents. Bioorg Med Chem Lett 11:1009-13 (2001)  
Target
Name:
Collagenase 3
Synonyms:
Collagenase 3 MMP13_RAT Matrix metalloproteinase-13 UMRCASE
Type:
PROTEIN
Mol. Mass.:
53359.23
Organism:
Rattus norvegicus
Description:
ChEMBL_424298
Residue:
466
  
Inhibitor
Name:
BDBM50098914
Synonyms:
(R)-5-Hydroxycarbamoyl-4-(4-methoxy-benzenesulfonyl)-[1,4]diazepane-1-carboxylic acid benzyl ester | CHEMBL267939
Type:
Small organic molecule
Emp. Form.:
C21H25N3O7S
Mol. Mass.:
463.504
SMILES:
COc1ccc(cc1)S(=O)(=O)N1CCN(CC[C@@H]1C(=O)NO)C(=O)OCc1ccccc1
: