Target
Isoleucine--tRNA ligase, cytoplasmic
Ligand
BDBM50099114
Substrate
Meas. Tech.
ChEBML_67938
IC50
64400±n/a nM
Citation
 Lee, JKang, SUKim, SYKim, SEJob, YJKim, S Vanilloid and isovanilloid analogues as inhibitors of methionyl-tRNA and isoleucyl-tRNA synthetases. Bioorg Med Chem Lett 11:965-8 (2001)  
Target
Name:
Isoleucine--tRNA ligase, cytoplasmic
Synonyms:
IARS Isoleucyl-tRNA synthetase | SYIC_HUMAN
Type:
PROTEIN
Mol. Mass.:
144489.34
Organism:
Homo sapiens (Human)
Description:
ChEMBL_88804
Residue:
1262
  
Inhibitor
Name:
BDBM50099114
Synonyms:
(S)-1-[2-(4-Hydroxy-3-methoxy-benzoylamino)-ethoxycarbonyl]-2-methyl-butyl-ammonium
Type:
Small organic molecule
Emp. Form.:
C16H25N2O5
Mol. Mass.:
325.3796
SMILES:
CCC(C)[C@H]([NH3+])C(=O)OCCNC(=O)c1ccc(O)c(OC)c1
: