Target
Alpha-1D adrenergic receptor
Ligand
BDBM50099320
Substrate
Meas. Tech.
ChEBML_32439
Ki
0.308000±n/a nM
Citation
 Carroll, WASippy, KBEsbenshade, TABuckner, SAHancock, AAMeyer, MD Two novel and potent 3-[(o-methoxyphenyl)piperazinylethyl]-5-phenylthien. Bioorg Med Chem Lett 11:1119-21 (2001)  
Target
Name:
Alpha-1D adrenergic receptor
Synonyms:
ADA1D_HUMAN ADRA1D Adrenergic receptor alpha Alpha 1D-adrenoreceptor Alpha-1D adrenoceptor adrenergic Alpha1D
Type:
Enzyme Catalytic Domain
Mol. Mass.:
60485.82
Organism:
Homo sapiens (Human)
Description:
adrenergic Alpha1D ADRA1D HUMAN::P25100
Residue:
572
  
Inhibitor
Name:
BDBM50099320
Synonyms:
3-{2-[4-(2-Methoxy-phenyl)-piperazin-1-yl]-ethyl}-1H-thieno[2,3-d]pyrimidine-2,4-dione | CHEMBL13735
Type:
Small organic molecule
Emp. Form.:
C19H22N4O3S
Mol. Mass.:
386.468
SMILES:
COc1ccccc1N1CCN(CCn2c(=O)[nH]c3sccc3c2=O)CC1
: