Target
Carbonic anhydrase 1
Ligand
BDBM50114180
Substrate
Meas. Tech.
ChEBML_47498
Ki
2.10±n/a nM
Citation
 Scozzafava, ASupuran, CT Carbonic anhydrase inhibitors. Preparation of potent sulfonamides inhibitors incorporating bile acid tails. Bioorg Med Chem Lett 12:1551-7 (2002)  
Target
Name:
Carbonic anhydrase 1
Synonyms:
CA-I CAB Carbonate dehydratase I Carbonic anhydrase 1 (CA I) Carbonic anhydrase 1 (Recombinant CA I) Carbonic anhydrase B Carbonic anhydrase I (CA I) Carbonic anhydrase I (CAI) Carbonic anhydrase isoenzyme I (hCA I) | hCA
Type:
Enzyme
Mol. Mass.:
28873.37
Organism:
Homo sapiens (Human)
Description:
P00915
Residue:
261
  
Inhibitor
Name:
BDBM50114180
Synonyms:
(1R,2R,5R)-4-((1R,5S,8S,10R,11S,12S)-3,12-Dihydroxy-10,13-dimethyl-hexadecahydro-cyclopenta[a]phenanthren-17-yl)-pentanoic acid [2-(5-sulfamoyl-[1,3,4]thiadiazol-2-ylcarbamoyl)-ethyl]-amide | CHEMBL3137789
Type:
Small organic molecule
Emp. Form.:
C29H47N5O6S2
Mol. Mass.:
625.843
SMILES:
[H][C@@]1(CC[C@@]2([H])[C@]3([H])CC[C@]4([H])C[C@H](O)CC[C@]4(C)[C@@]3([H])C[C@H](O)[C@]12C)[C@H](C)CCC(=O)NCCC(=O)Nc1nnc(s1)S(N)(=O)=O
: