Target
Carbonic anhydrase 1
Ligand
BDBM50114135
Substrate
Meas. Tech.
ChEBML_47498
Ki
39±n/a nM
Citation
 Scozzafava, ASupuran, CT Carbonic anhydrase inhibitors. Preparation of potent sulfonamides inhibitors incorporating bile acid tails. Bioorg Med Chem Lett 12:1551-7 (2002)  
Target
Name:
Carbonic anhydrase 1
Synonyms:
CA-I CAB Carbonate dehydratase I Carbonic anhydrase 1 (CA I) Carbonic anhydrase 1 (Recombinant CA I) Carbonic anhydrase B Carbonic anhydrase I (CA I) Carbonic anhydrase I (CAI) Carbonic anhydrase isoenzyme I (hCA I) | hCA
Type:
Enzyme
Mol. Mass.:
28873.37
Organism:
Homo sapiens (Human)
Description:
P00915
Residue:
261
  
Inhibitor
Name:
BDBM50114135
Synonyms:
(R)-4-((8S,10S,12S,14R,15R,17S)-10,13-Dimethyl-3,7,12-trioxo-hexadecahydro-cyclopenta[a]phenanthren-17-yl)-pentanoic acid (2-sulfamoyl-benzothiazol-6-yl)-amide | CHEMBL3138424
Type:
Small organic molecule
Emp. Form.:
C31H39N3O6S2
Mol. Mass.:
613.788
SMILES:
[H][C@@]1(CC[C@@]2([H])[C@]3([H])C(=O)C[C@]4([H])CC(=O)CC[C@]4(C)[C@@]3([H])CC(=O)[C@]12C)[C@H](C)CCC(=O)Nc1ccc2nc(sc2c1)S(N)(=O)=O
: