Target
Substance-K receptor
Ligand
BDBM50116078
Substrate
Meas. Tech.
ChEBML_209384
Ki
0.400000±n/a nM
Citation
 Ting, PCLee, JFShih, NYPiwinski, JJAnthes, JCChapman, RWRizzo, CAHey, JANg, KNomeir, AA Identification of a novel 1'-[5-((3,5-dichlorobenzoyl)methylamino)-3-(3,4-dichlorophenyl)-4-(methoxyimino)pentyl]-2-oxo-(1,4'-bipiperidine) as a dual NK(1)/NK(2) antagonist. Bioorg Med Chem Lett 12:2125-8 (2002)  
Target
Name:
Substance-K receptor
Synonyms:
NK2R_CAVPO Neurokinin NK2 TACR2
Type:
Enzyme Catalytic Domain
Mol. Mass.:
45106.00
Organism:
GUINEA PIG
Description:
Neurokinin NK2 TACR2 GUINEA PIG::Q64077
Residue:
402
  
Inhibitor
Name:
BDBM50116078
Synonyms:
3,5-Dichloro-N-[3-(3,4-dichloro-phenyl)-2-methoxyimino-5-(3-methylcarbamoylmethyl-2-oxo-[1,4']bipiperidinyl-1'-yl)-pentyl]-N-ethyl-benzamide SCH 206272
Type:
Small organic molecule
Emp. Form.:
C33H41Cl4N5O4
Mol. Mass.:
713.522
SMILES:
CNC(=O)CC1CCCN(C2CCN(CC[C@@H](\C(CN(C)C(=O)c3cc(Cl)cc(Cl)c3)=N\OC)c3ccc(Cl)c(Cl)c3)CC2)C1=O
: