Target
4-hydroxyphenylpyruvate dioxygenase
Ligand
BDBM50088795
Substrate
Meas. Tech.
ChEBML_542
IC50
560±n/a nM
Citation
 Huang, MYang, DYShang, ZZou, JYu, Q 3D-QSAR studies on 4-hydroxyphenylpyruvate dioxygenase inhibitors by comparative molecular field analysis (CoMFA). Bioorg Med Chem Lett 12:2271-5 (2002)  
Target
Name:
4-hydroxyphenylpyruvate dioxygenase
Synonyms:
HPD | HPPD_PIG
Type:
PROTEIN
Mol. Mass.:
45064.25
Organism:
Sus scrofa
Description:
ChEMBL_541
Residue:
393
  
Inhibitor
Name:
BDBM50088795
Synonyms:
2-(2-Bromo-benzoyl)-cyclohexane-1,3-dione CHEMBL307635
Type:
Small organic molecule
Emp. Form.:
C13H11BrO3
Mol. Mass.:
295.129
SMILES:
Brc1ccccc1C(=O)C1C(=O)CCCC1=O
: