Target
cGMP-specific 3',5'-cyclic phosphodiesterase
Ligand
BDBM50116711
Substrate
Meas. Tech.
ChEMBL_155368 (CHEMBL762513)
Ki
5±n/a nM
Citation
 Shin, HJKim, HJKwak, JHChun, HOKim, JHPark, HKim, DHLee, YS A prenylated flavonol, sophoflavescenol: a potent and selective inhibitor of cGMP phosphodiesterase 5. Bioorg Med Chem Lett 12:2313-6 (2002)  
Target
Name:
cGMP-specific 3',5'-cyclic phosphodiesterase
Synonyms:
PDE5A_RAT Pde5a | Phosphodiesterase 5A
Type:
PROTEIN
Mol. Mass.:
94547.60
Organism:
Rattus norvegicus
Description:
ChEMBL_155367
Residue:
833
  
Inhibitor
Name:
BDBM50116711
Synonyms:
3,7-Dihydroxy-2-(4-hydroxy-phenyl)-5-methoxy-8-(3-methyl-but-2-enyl)-chromen-4-one CHEMBL77651 | SOPHOFLAVESCENOL
Type:
Small organic molecule
Emp. Form.:
C21H20O6
Mol. Mass.:
368.3799
SMILES:
[#6]-[#8]-c1cc(-[#8])c(-[#6]\[#6]=[#6](\[#6])-[#6])c2oc(c(-[#8])c(=O)c12)-c1ccc(-[#8])cc1
: