Target
Isoform 4 of Membrane-associated guanylate kinase, WW and PDZ domain-containing protein 3 (4)
Ligand
BDBM50366790
Substrate
Meas. Tech.
ChEBML_99589
IC50
29000±n/a nM
Citation
 Novak, KAFujii, NGuy, RK Investigation of the PDZ domain ligand binding site using chemically modified peptides. Bioorg Med Chem Lett 12:2471-4 (2002)  
Target
Name:
Isoform 4 of Membrane-associated guanylate kinase, WW and PDZ domain-containing protein 3 (4)
Synonyms:
KIAA1634 MAGI3_HUMAN Membrane-associated guanylate kinase, WW and PDZ domain-containing protein 3 (4) Membrane-associated guanylate kinase-related 3 isoform 1
Type:
PROTEIN
Mol. Mass.:
165630.05
Organism:
Homo sapiens (Human)
Description:
ChEMBL_99591
Residue:
1506
  
Inhibitor
Name:
BDBM50366790
Synonyms:
CHEMBL1790639
Type:
Small organic molecule
Emp. Form.:
C38H58N8O11
Mol. Mass.:
802.9141
SMILES:
CC[C@H](C)[C@H](NC(=O)[C@H](CCC(N)=O)NC(=O)[C@@H](NC(C)=O)[C@H](C)O)C(=O)N(C)[C@@H]([C@H](C)O)C(=O)N[C@@H](Cc1c[nH]c2ccccc12)C(=O)N[C@@H](C(C)C)C(O)=O
: