Target
Acetylcholinesterase
Ligand
BDBM50117589
Substrate
Meas. Tech.
ChEBML_70883
EC50
1440±n/a nM
Citation
 Clark, JKCowley, PMuir, AWPalin, RPow, EProsser, ABTaylor, RZhang, MQ Quaternary salts of E2020 analogues as acetylcholinesterase inhibitors for the reversal of neuromuscular block. Bioorg Med Chem Lett 12:2565-8 (2002)  
Target
Name:
Acetylcholinesterase
Synonyms:
ACES_HUMAN Acetylcholinesterase (AChE) | Acetylcholinesterase (human AChE)
Type:
Enzyme
Mol. Mass.:
67792.70
Organism:
Homo sapiens (Human)
Description:
P22303
Residue:
614
  
Inhibitor
Name:
BDBM50117589
Synonyms:
1-Benzyl-4-[(5,6-dimethoxy-1-oxo-indan-2-yl)-hydroxy-methyl]-1-methyl-piperidinium | CHEMBL87883
Type:
Small organic molecule
Emp. Form.:
C25H32NO4
Mol. Mass.:
410.5253
SMILES:
COc1cc2CC(C(O)C3CC[N+](C)(Cc4ccccc4)CC3)C(=O)c2cc1OC
: