Target
Acetylcholinesterase
Ligand
BDBM50117617
Substrate
Meas. Tech.
ChEBML_28291
EC50
1670±n/a nM
Citation
 Palin, RClark, JKCowley, PMuir, AWPow, EProsser, ABTaylor, RZhang, MQ Novel piperidinium and pyridinium agents as water-soluble acetylcholinesterase inhibitors for the reversal of neuromuscular blockade. Bioorg Med Chem Lett 12:2569-72 (2002)  
Target
Name:
Acetylcholinesterase
Synonyms:
ACES_HUMAN Acetylcholinesterase (AChE) | Acetylcholinesterase (human AChE)
Type:
Enzyme
Mol. Mass.:
67792.70
Organism:
Homo sapiens (Human)
Description:
P22303
Residue:
614
  
Inhibitor
Name:
BDBM50117617
Synonyms:
4-[3-(5,6-Dimethoxy-benzo[b]thiophen-2-yl)-3-oxo-propyl]-1-(4-methoxycarbonyl-benzyl)-pyridinium | CHEMBL87280
Type:
Small organic molecule
Emp. Form.:
C27H26NO5S
Mol. Mass.:
476.563
SMILES:
COC(=O)c1ccc(C[n+]2ccc(CCC(=O)c3cc4cc(OC)c(OC)cc4s3)cc2)cc1
: