Target
D(2) dopamine receptor
Ligand
BDBM50000483
Substrate
Meas. Tech.
ChEMBL_58681 (CHEMBL670245)
IC50
>1000±n/a nM
Citation
 Iriepa, IVillasante, FJGálvez, ELabeaga, LInnerarity, AOrjales, A Synthesis and pharmacology of isoquinuclidine derivatives as 5-HT(3) ligands. Bioorg Med Chem Lett 12:189-92 (2001)  
Target
Name:
D(2) dopamine receptor
Synonyms:
DOPAMINE D2 DOPAMINE D2 Short Dopamine D2 receptor Drd2
Type:
G Protein-Coupled Receptor (GPCR)
Mol. Mass.:
50931.60
Organism:
Rattus norvegicus (rat)
Description:
P61169
Residue:
444
  
Inhibitor
Name:
BDBM50000483
Synonyms:
(BRL 43694)1-Methyl-1H-indazole-3-carboxylic acid (9-methyl-9-aza-bicyclo[3.3.1]non-3-yl)-amide 1-Methyl-1H-indazole-3-carboxylic acid (8-methyl-8-aza-bicyclo[3.2.1]oct-3-yl)-amide 1-Methyl-1H-indazole-3-carboxylic acid (9-methyl-9-aza-bicyclo[3.3.1]non-3-yl)-amide(BRL 43694) 1-methyl-N-((1S,5R)-9-methyl-9-aza-bicyclo[3.3.1]nonan-3-yl)-1H-indazole-3-carboxamide BRL 43694 CHEMBL519643 LY-278584
Type:
Small organic molecule
Emp. Form.:
C18H24N4O
Mol. Mass.:
312.4094
SMILES:
CN1C2CCCC1CC(C2)NC(=O)c1nn(C)c2ccccc12
: