Target
Vasopressin V1a receptor
Ligand
BDBM50029644
Substrate
Meas. Tech.
ChEMBL_214566 (CHEMBL818692)
Ki
24±n/a nM
Citation
 Kakefuda, ATsukada, JKusayama, TTahara, ATsukamoto, S N-Methylbenzanilide derivatives as a novel class of selective V(1A) receptor antagonists. Bioorg Med Chem Lett 12:229-32 (2001)  
Target
Name:
Vasopressin V1a receptor
Synonyms:
Avpr1a VASOPRESSIN V1A Vasopressin V1a receptor | Vasopressin receptor
Type:
Enzyme Catalytic Domain
Mol. Mass.:
47674.81
Organism:
RAT
Description:
VASOPRESSIN V1A AVPR1A RAT::P30560
Residue:
424
  
Inhibitor
Name:
BDBM50029644
Synonyms:
CHEMBL296908 N-(3-{4-[4-(2-Oxo-3,4-dihydro-2H-quinolin-1-yl)-piperidine-1-carbonyl]-phenoxy}-propyl)-acetamide OPC-21268
Type:
Small organic molecule
Emp. Form.:
C26H31N3O4
Mol. Mass.:
449.542
SMILES:
CC(=O)NCCCOc1ccc(cc1)C(=O)N1CCC(CC1)N1C(=O)CCc2ccccc12
: