Target
Prothrombin
Ligand
BDBM50085450
Substrate
Meas. Tech.
ChEBML_208729
IC50
270±n/a nM
Citation
 Hanessian, STherrien, EGranberg, KNilsson, I Targeting thrombin and factor VIIa: design, synthesis, and inhibitory activity of functionally relevant indolizidinones. Bioorg Med Chem Lett 12:2907-11 (2002)  
Target
Name:
Prothrombin
Synonyms:
Activation peptide fragment 1 Coagulation factor II Prothrombin precursor Thrombin heavy chain | Thrombin light chain
Type:
Protein
Mol. Mass.:
70029.57
Organism:
Homo sapiens (Human)
Description:
P00734
Residue:
622
  
Inhibitor
Name:
BDBM50085450
Synonyms:
(3S,6S,8aS)-6-Hydroxy-6-methyl-5-oxo-octahydro-indolizine-3-carboxylic acid 4-carbamimidoyl-benzylamide; hydrochloride | CHEMBL542661
Type:
Small organic molecule
Emp. Form.:
C18H24N4O3
Mol. Mass.:
344.4082
SMILES:
C[C@]1(O)CC[C@@H]2CC[C@H](N2C1=O)C(=O)NCc1ccc(cc1)C(N)=N
: