Target
D(3) dopamine receptor
Ligand
BDBM50109021
Substrate
Meas. Tech.
ChEBML_62113
Ki
0.400000±n/a nM
Citation
 Mewshaw, REZhao, RShi, XMarquis, KBrennan, JAMazandarani, HCoupet, JAndree, TH New generation dopaminergic agents. Part 8: heterocyclic bioisosteres that exploit the 7-OH-2-(aminomethyl)chroman D(2) template. Bioorg Med Chem Lett 12:271-4 (2002)  
Target
Name:
D(3) dopamine receptor
Synonyms:
DOPAMINE D3 DRD3_HUMAN Dopamine D3 receptor (D3) Dopamine receptor Dopamine receptor D3
Type:
Mol. Mass.:
44243.43
Organism:
Homo sapiens (Human)
Description:
Residue:
400
  
Inhibitor
Name:
BDBM50109021
Synonyms:
(R)-8-(Benzylamino-methyl)-3,6,7,8-tetrahydro-1H-chromeno[7,8-d]imidazol-2-one | CHEMBL420986
Type:
Small organic molecule
Emp. Form.:
C18H19N3O2
Mol. Mass.:
309.3624
SMILES:
O=c1[nH]c2ccc3CC[C@H](CNCc4ccccc4)Oc3c2[nH]1
: