Target
Tubulin beta-2B chain
Ligand
BDBM50109343
Substrate
Meas. Tech.
ChEBML_211170
Ki
630±n/a nM
Citation
 Li, QWoods, KWClaiborne, AGwaltney, SLBarr, KJLiu, GGehrke, LCredo, RBHui, YHLee, JWarner, RBKovar, PNukkala, MAZielinski, NATahir, SKFitzgerald, MKim, KHMarsh, KFrost, DNg, SCRosenberg, SSham, HL Synthesis and biological evaluation of 2-indolyloxazolines as a new class of tubulin polymerization inhibitors. Discovery of A-289099 as an orally active antitumor agent. Bioorg Med Chem Lett 12:465-9 (2002)  
Target
Name:
Tubulin beta-2B chain
Synonyms:
TBB2B_BOVIN Tubulin | Tubulin beta chain
Type:
PROTEIN
Mol. Mass.:
49932.38
Organism:
Bos taurus
Description:
ChEMBL_211651
Residue:
445
  
Inhibitor
Name:
BDBM50109343
Synonyms:
1-Methyl-5-[(S)-5-(3,4,5-trimethoxy-phenyl)-4,5-dihydro-oxazol-2-yl]-1H-indole CHEMBL143850
Type:
Small organic molecule
Emp. Form.:
C21H22N2O4
Mol. Mass.:
366.4104
SMILES:
COc1cc(cc(OC)c1OC)[C@H]1CN=C(O1)c1ccc2n(C)ccc2c1
: