Target
D(2) dopamine receptor
Ligand
BDBM50109952
Substrate
Meas. Tech.
ChEMBL_60076 (CHEMBL671732)
Ki
6200±n/a nM
Citation
 Löber, SAboul-Fadl, THübner, HGmeiner, P Di- and trisubstituted pyrazolo[1,5-a]pyridine derivatives: synthesis, dopamine receptor binding and ligand efficacy. Bioorg Med Chem Lett 12:633-6 (2002)  
Target
Name:
D(2) dopamine receptor
Synonyms:
D(2) dopamine receptor DOPAMINE D2 Long DRD2 Dopamine D2 receptor Dopamine D2 receptor (D2R) Dopamine2-like | d2
Type:
Cell-surface receptors
Mol. Mass.:
50647.10
Organism:
Homo sapiens (Human)
Description:
P14416
Residue:
443
  
Inhibitor
Name:
BDBM50109952
Synonyms:
3-((4-(4-chlorophenyl)piperazin-1-yl)methyl)-7-ethynyl-pyrazolo[1,5-a]pyridine 4-(4-Chloro-phenyl)-1-(7-ethynyl-pyrazolo[1,5-a]pyridin-3-ylmethyl)-piperazin-1-ium | CHEMBL160952
Type:
Small organic molecule
Emp. Form.:
C20H19ClN4
Mol. Mass.:
350.845
SMILES:
Clc1ccc(cc1)N1CCN(Cc2cnn3c(cccc23)C#C)CC1
: