Target
D(2) dopamine receptor
Ligand
BDBM50109944
Substrate
Meas. Tech.
ChEMBL_60076 (CHEMBL671732)
Ki
25000±n/a nM
Citation
 Löber, SAboul-Fadl, THübner, HGmeiner, P Di- and trisubstituted pyrazolo[1,5-a]pyridine derivatives: synthesis, dopamine receptor binding and ligand efficacy. Bioorg Med Chem Lett 12:633-6 (2002)  
Target
Name:
D(2) dopamine receptor
Synonyms:
D(2) dopamine receptor DOPAMINE D2 Long DRD2 Dopamine D2 receptor Dopamine D2 receptor (D2R) Dopamine2-like | d2
Type:
Cell-surface receptors
Mol. Mass.:
50647.10
Organism:
Homo sapiens (Human)
Description:
P14416
Residue:
443
  
Inhibitor
Name:
BDBM50109944
Synonyms:
3-[4-(4-Chloro-phenyl)-piperazin-1-ylmethyl]-7-ethynyl-2-methyl-pyrazolo[1,5-a]pyridine | CHEMBL156851
Type:
Small organic molecule
Emp. Form.:
C21H21ClN4
Mol. Mass.:
364.871
SMILES:
Cc1nn2c(cccc2c1CN1CCN(CC1)c1ccc(Cl)cc1)C#C
: