Target
D(1A) dopamine receptor
Ligand
BDBM50109948
Substrate
Meas. Tech.
ChEBML_60335
Ki
1000±n/a nM
Citation
 Löber, SAboul-Fadl, THübner, HGmeiner, P Di- and trisubstituted pyrazolo[1,5-a]pyridine derivatives: synthesis, dopamine receptor binding and ligand efficacy. Bioorg Med Chem Lett 12:633-6 (2002)  
Target
Name:
D(1A) dopamine receptor
Synonyms:
D(1A) dopamine receptor DOPAMINE D1 DRD1_BOVIN | Dopamine receptor
Type:
Enzyme Catalytic Domain
Mol. Mass.:
49330.65
Organism:
BOVINE
Description:
DOPAMINE D1 DRD1 BOVINE::Q95136
Residue:
446
  
Inhibitor
Name:
BDBM50109948
Synonyms:
3-[4-(4-Chloro-phenyl)-piperazin-1-ylmethyl]-7-(4-fluoro-phenyl)-2-methyl-pyrazolo[1,5-a]pyridine | CHEMBL160749
Type:
Small organic molecule
Emp. Form.:
C25H24ClFN4
Mol. Mass.:
434.936
SMILES:
Cc1nn2c(cccc2c1CN1CCN(CC1)c1ccc(Cl)cc1)-c1ccc(F)cc1
: