Target
D(3) dopamine receptor
Ligand
BDBM50109949
Substrate
Meas. Tech.
ChEBML_62138
Ki
410±n/a nM
Citation
 Löber, SAboul-Fadl, THübner, HGmeiner, P Di- and trisubstituted pyrazolo[1,5-a]pyridine derivatives: synthesis, dopamine receptor binding and ligand efficacy. Bioorg Med Chem Lett 12:633-6 (2002)  
Target
Name:
D(3) dopamine receptor
Synonyms:
DOPAMINE D3 DRD3_HUMAN Dopamine D3 receptor (D3) Dopamine receptor Dopamine receptor D3
Type:
Mol. Mass.:
44243.43
Organism:
Homo sapiens (Human)
Description:
Residue:
400
  
Inhibitor
Name:
BDBM50109949
Synonyms:
7-(4-Benzyl-piperazin-1-yl)-3-[4-(4-chloro-phenyl)-piperazin-1-ylmethyl]-pyrazolo[1,5-a]pyridine | CHEMBL160266
Type:
Small organic molecule
Emp. Form.:
C29H33ClN6
Mol. Mass.:
501.066
SMILES:
Clc1ccc(cc1)N1CCN(Cc2cnn3c(cccc23)N2CCN(Cc3ccccc3)CC2)CC1
: